{"text_format":"1","workbook":"xlsx","n_sheets":9,"sheets":["0. Instructions","1. Description generale","2. Bilan annees precedentes","3. Budget","4. Equipements","5. Criteres de selection","6. Forfaits","7. Fiche SLIME CLER","Listes"],"not_rendered":{"charts":0,"images":18,"macros":1,"external_links":0,"defined_names":41,"comments":1,"pivot_tables":0},"unopened":[],"bounds":{"document_bytes":16777216,"sheet_cells":100000,"rows_first":2000,"rows_last":500,"rows_between":2000,"halvings":0,"cell_chars":16384,"cell_head_chars":4096},"cells_cut":0,"cells_raw":0,"read":"whole","date_system":"1904"}

{"sheet":"0. Instructions","index":0,"n_rows":29,"n_cols":1,"rows_kept":29,"cut":false,"hidden":false,"merged":[[15,0,15,3],[0,0,3,3],[5,0,5,3],[4,0,4,3],[6,0,6,3],[8,0,8,3],[9,0,9,3],[7,0,7,3],[10,0,10,3],[11,0,11,3],[12,0,12,3],[13,0,13,3],[14,0,14,3],[26,0,26,3],[27,0,27,3],[28,0,28,3],[16,0,16,3],[22,0,22,3],[23,0,23,3],[24,0,24,3],[21,0,21,3],[25,0,25,3],[17,0,17,3],[18,0,18,3],[19,0,19,3],[20,0,20,3]]}
["Note pour remplissage du dossier de candidature"]
[]
[]
[]
["Informations générales"]
["Se référer au site internet du Slime (www.lesslime.fr) pour :\nle descriptif du dispositif, la foire aux questions, les vidéos présentant les visites à domicile, le dossier de candidature et les actualités du dispositif"]
["Envoyer une version par email et une version papier accompagnée d'un courrier (après validation du dossier par email) à signature de l'élu en charge du dispositif et entête de la collectivité pilote"]
["La collectivité ne doit remplir que les cases jaunes et rouges foncées (menus déroulants). Les cases rouges clair se remplissent automatiquement"]
["NB : Pour aller à la ligne dans une même cellule, taper [Alt]+[Entrée] sur PC et [ctrlt]+[cmd]+[entrée] sur mac "]
["Pour l’onglet 1. Description générale"]
{"$rows_left_out":20}
{"sheet":"1. Description generale","index":1,"n_rows":125,"n_cols":9,"rows_kept":125,"cut":false,"hidden":false,"merged":[[124,0,124,2],[123,0,123,3],[123,6,124,6],[122,0,122,6],[113,8,114,8],[112,0,112,8],[107,8,108,8],[110,8,111,8],[106,0,106,8],[108,0,108,2],[111,0,111,2],[6,3,6,4],[8,3,8,4],[9,3,9,4],[91,3,93,3],[17,3,18,3],[17,4,18,4],[53,3,60,3],[29,1,29,3],[22,0,22,2],[22,3,22,4],[20,0,20,1],[20,2,20,3],[73,3,74,3],[75,3,76,3],[72,0,82,2],[0,1,3,4],[115,0,117,4],[41,1,41,4],[24,1,24,3],[24,4,24,7],[29,4,29,7],[114,0,114,2],[83,0,83,4],[7,3,7,4],[4,3,4,4],[5,3,5,4],[50,0,50,4],[51,0,51,4],[61,0,61,4],[42,0,43,0],[16,0,16,1],[94,3,94,4],[84,0,87,2],[84,3,85,3],[103,0,105,8],[109,0,109,8],[121,0,121,2],[45,0,45,4],[71,0,71,4],[46,0,49,2],[46,3,48,3],[88,0,88,4],[52,0,52,4],[62,0,70,2],[119,0,119,2],[118,0,118,4],[120,0,120,4],[95,3,101,3],[92,4,93,4],[89,0,102,2],[53,0,60,2],[77,3,78,3]]}
[null,"Description générale du dispositif\n\nMerci de ne compléter que les cases jaunes et rouges foncées (menus déroulants)\nLes cases rouges clair se remplissent automatiquement"]
[]
[]
[]
["Collectivité pilotant le Slime (cf critère de sélection 1)","Nom local du dispositif (par ex. Slime CLER…)","Territoire d'action du dispositif Slime","Département"]
[]
["Responsable du dispositif (NOM Prénom)","Adresse email","Numéro de téléphone","Service"]
[]
["Date de début du dispositif (jj/mm/aaaa)","Date de fin du dispositif (jj/mm/aaaa)","Durée de l'action (en mois)","Adresse"]
[null,null,{"$f":"ROUND((B10-A10)*12/365,0)","v":0}]
{"$rows_left_out":116}
{"sheet":"2. Bilan annees precedentes","index":2,"n_rows":21,"n_cols":5,"rows_kept":21,"cut":false,"hidden":false,"merged":[[0,1,3,4],[4,2,4,3],[5,2,5,3],[4,0,4,1],[5,0,5,1],[6,0,6,1],[7,0,7,1],[8,2,8,3],[18,0,18,4],[5,4,7,4],[13,0,13,4],[15,0,15,4],[17,0,17,4],[9,2,9,3],[6,2,6,3],[8,0,8,1],[20,0,20,4],[19,0,19,4],[21,0,21,4],[7,2,7,3],[12,0,12,4],[14,0,14,4],[16,0,16,4],[10,2,10,3],[11,2,11,3],[10,0,10,1],[11,0,11,1],[9,4,11,4],[9,0,9,1]]}
[null,"Bilan de la période précédente\n\nMerci de ne compléter que les cases jaunes et rouges foncées (menus déroulants)\nLes cases rouges clair se remplissent automatiquement"]
[]
[]
[]
["Date de début du Slime",null,"Date de fin du Slime",null,"Durée de l'action (en mois)"]
[null,null,null,null,{"$f":"ROUND((C6-A6)*12/365,0)","v":0}]
["Budget prévisionnel de la collectivité pour le Slime ",null,"Budget réel de la collectivité pour le Slime "]
[]
["Nombre prévu de ménages recevant une visite sur la période",null,"Nombre réel de ménages ayant reçu une visite sur la période",null,"Nombre de ménages sur le territoire d'action"]
[]
{"$rows_left_out":12}
{"sheet":"3. Budget","index":3,"n_rows":100,"n_cols":27,"rows_kept":100,"cut":false,"hidden":false,"merged":[[74,0,74,4],[74,7,74,11],[74,14,74,18],[74,21,74,25],[81,21,81,25],[83,21,83,25],[73,21,73,25],[77,1,77,2],[77,3,77,4],[78,1,78,2],[79,1,79,2],[80,1,80,2],[76,0,76,5],[81,0,81,4],[76,7,76,12],[77,8,77,9],[77,10,77,11],[78,8,78,9],[79,8,79,9],[80,8,80,9],[81,7,81,11],[77,17,77,18],[76,14,76,19],[77,15,77,16],[76,21,76,26],[77,22,77,23],[78,10,78,11],[79,10,79,11],[42,21,42,25],[55,21,55,25],[56,21,56,25],[69,21,69,25],[58,26,62,26],[64,26,68,26],[44,26,48,26],[50,26,54,26],[77,24,77,25],[21,26,30,26],[32,26,41,26],[0,7,3,12],[4,7,4,12],[5,7,5,11],[6,7,6,11],[0,21,3,26],[4,21,4,26],[5,21,5,25],[6,21,6,25],[19,21,19,25],[8,26,12,26],[14,26,18,26],[0,14,3,19],[4,14,4,19],[5,14,5,18],[6,14,6,18],[8,19,12,19],[14,19,18,19],[19,14,19,18],[21,19,30,19],[32,19,41,19],[8,12,12,12],[14,12,18,12],[90,2,90,5],[91,2,91,5],[42,14,42,18],[44,19,48,19],[50,19,54,19],[55,14,55,18],[56,14,56,18],[58,19,62,19],[64,19,68,19],[69,14,69,18],[73,14,73,18],[83,14,83,18],[85,0,88,5],[89,0,89,5],[83,7,83,11],[69,7,69,11],[73,7,73,11],[78,15,78,16],[79,15,79,16],[80,15,80,16],[81,14,81,18],[78,3,78,4],[79,3,79,4],[80,3,80,4],[19,7,19,11],[21,12,30,12],[32,12,41,12],[55,7,55,11],[56,7,56,11],[58,12,62,12],[64,12,68,12],[42,7,42,11],[44,12,48,12],[50,12,54,12],[94,2,94,5],[95,2,95,5],[96,2,96,5],[0,0,3,5],[4,0,4,5],[5,0,5,4],[6,0,6,4],[19,0,19,4],[42,0,42,4],[55,0,55,4],[56,0,56,4],[69,0,69,4],[73,0,73,4],[8,5,12,5],[50,5,54,5],[44,5,48,5],[14,5,18,5],[21,5,30,5],[32,5,41,5],[58,5,62,5],[64,5,68,5],[92,2,92,5],[93,2,93,5],[83,0,83,4],[80,10,80,11],[78,17,78,18],[79,17,79,18],[80,17,80,18],[78,24,78,25],[79,24,79,25],[80,24,80,25],[78,22,78,23],[79,22,79,23],[80,22,80,23]]}
["Budget prévisionnel\n\nMerci de ne compléter que les cases jaunes et rouges foncées (menus déroulants)\nLes cases rouges clair se remplissent automatiquement",null,null,null,null,null,null,"Budget prévisionnel\n\nMerci de ne compléter que les cases jaunes et rouges foncées (menus déroulants)\nLes cases rouges clair se remplissent automatiquement",null,null,null,null,null,null,"Budget prévisionnel\n\nMerci de ne compléter que les cases jaunes et rouges foncées (menus déroulants)\nLes cases rouges clair se remplissent automatiquement",null,null,null,null,null,null,"Budget prévisionnel\n\nMerci de ne compléter que les cases jaunes et rouges foncées (menus déroulants)\nLes cases rouges clair se remplissent automatiquement"]
[]
[]
[]
[{"$f":"CONCATENATE(\"DÉPENSES PRÉVISIONNELLES DE LA COLLECTIVITÉ ANNÉE \",'1. Description generale'!A31)","v":"DÉPENSES PRÉVISIONNELLES DE LA COLLECTIVITÉ ANNÉE 1904"},null,null,null,null,null,null,{"$f":"CONCATENATE(\"DÉPENSES PRÉVISIONNELLES DE LA COLLECTIVITÉ ANNÉE \",'1. Description generale'!A32)","v":"DÉPENSES PRÉVISIONNELLES DE LA COLLECTIVITÉ ANNÉE -"},null,null,null,null,null,null,{"$f":"CONCATENATE(\"DÉPENSES PRÉVISIONNELLES DE LA COLLECTIVITÉ ANNÉE \",'1. Description generale'!A33)","v":"DÉPENSES PRÉVISIONNELLES DE LA COLLECTIVITÉ ANNÉE -"},null,null,null,null,null,null,{"$f":"CONCATENATE(\"DÉPENSES PRÉVISIONNELLES DE LA COLLECTIVITÉ ANNÉE \",'1. Description generale'!A34)","v":"DÉPENSES PRÉVISIONNELLES DE LA COLLECTIVITÉ ANNÉE -"}]
[{"$f":" \"Activités \" & '1. Description generale'!A31","v":"Activités 1904"},null,null,null,null,{"$f":"\"Dépenses prévisionnelles (€) \"& '1. Description generale'!A31","v":"Dépenses prévisionnelles (€) 1904"},null,{"$f":" \"Activités \" & '1. Description generale'!A32","v":"Activités -"},null,null,null,null,{"$f":"\"Dépenses prévisionnelles (€) \"& '1. Description generale'!A32","v":"Dépenses prévisionnelles (€) -"},null,{"$f":" \"Activités \" & '1. Description generale'!A33","v":"Activités -"},null,null,null,null,{"$f":"\"Dépenses prévisionnelles (€) \"& '1. Description generale'!A33","v":"Dépenses prévisionnelles (€) -"},null,{"$f":" \"Activités \" & '1. Description generale'!A34","v":"Activités -"},null,null,null,null,{"$f":"\"Dépenses prévisionnelles (€) \"& '1. Description generale'!A34","v":"Dépenses prévisionnelles (€) -"}]
["1. Coordination du dispositif et animation territoriale",null,null,null,null,{"$f":"F9+F15","v":0},null,"1. Coordination du dispositif et animation territoriale",null,null,null,null,{"$f":"M9+M15","v":0},null,"1. Coordination du dispositif et animation territoriale",null,null,null,null,{"$f":"T9+T15","v":0},null,"1. Coordination du dispositif et animation territoriale",null,null,null,null,{"$f":"AA9+AA15","v":0}]
["Dépenses d'exploitation (frais directs)","détailler dépense si besoin","Coût jour ou unitaire","Nombre (jours, km, kits, etc)","Montant (€)",null,null,"Dépenses d'exploitation (frais directs)","détailler dépense si besoin","Coût jour ou unitaire","Nombre (jours, km, kits, etc)","Montant (€)",null,null,"Dépenses d'exploitation (frais directs)","détailler dépense si besoin","Coût jour ou unitaire","Nombre (jours, km, kits, etc)","Montant (€)",null,null,"Dépenses d'exploitation (frais directs)","détailler dépense si besoin","Coût jour ou unitaire","Nombre (jours, km, kits, etc)","Montant (€)"]
[null,null,null,null,{"$f":"C9*D9","v":0},{"$f":"SUM(E9:E13)","v":0},null,null,null,null,null,{"$f":"J9*K9","v":0},{"$f":"SUM(L9:L13)","v":0},null,null,null,null,null,{"$f":"Q9*R9","v":0},{"$f":"SUM(S9:S13)","v":0},null,null,null,null,null,{"$f":"X9*Y9","v":0},{"$f":"SUM(Z9:Z13)","v":0}]
[null,null,null,null,{"$f":"C10*D10","v":0},null,null,null,null,null,null,{"$f":"J10*K10","v":0},null,null,null,null,null,null,{"$f":"Q10*R10","v":0},null,null,null,null,null,null,{"$f":"X10*Y10","v":0}]
{"$rows_left_out":91}
{"sheet":"4. Equipements","index":4,"n_rows":53,"n_cols":19,"rows_kept":53,"cut":false,"hidden":false,"merged":[[31,0,31,8],[32,0,32,3],[32,5,32,8],[31,10,31,18],[32,10,32,13],[32,15,32,18],[0,1,3,8],[0,11,3,18],[27,1,30,8],[27,11,30,18],[5,0,5,3],[5,5,5,8],[4,0,4,8],[4,10,4,18],[5,10,5,13],[5,15,5,18]]}
[null,"Budget prévisionnel - petits équipements\n\nMerci de ne compléter que les cases jaunes\nLes cases rouges clair se remplissent automatiquement",null,null,null,null,null,null,null,null,null,"Budget prévisionnel - petits équipements\n\nMerci de ne compléter que les cases jaunes\nLes cases rouges clair se remplissent automatiquement"]
[]
[]
[]
[{"$f":"CONCATENATE(\"ANNEE \",'1. Description generale'!A31)","v":"ANNEE 1904"},null,null,null,null,null,null,null,null,null,{"$f":"CONCATENATE(\"ANNEE \",'1. Description generale'!A32)","v":"ANNEE -"}]
["Liste des équipements d'économie d'énergie installés chez les ménages pendant la visite à domicile",null,null,null,null,"Liste des équipements de mesure utilisés pendant les visites à domicile",null,null,null,null,"Liste des équipements d'économie d'énergie installés chez les ménages pendant la visite à domicile",null,null,null,null,"Liste des équipements de mesure utilisés pendant les visites à domicile"]
["Équipement d'économies d'énergie","Coût unitaire","Nombre","Total",null,"Équipements de mesure","Coût unitaire","Nombre","Total",null,"Équipement d'économies d'énergie","Coût unitaire","Nombre","Total",null,"Équipements de mesure","Coût unitaire","Nombre","Total"]
["Lampe de classe A pour la métropole",null,null,{"$f":"B8*C8","v":0},null,"Thermomètre",null,null,{"$f":"G8*H8","v":0},null,"Lampe de classe A pour la métropole",null,null,{"$f":"L8*M8","v":0},null,"Thermomètre",null,null,{"$f":"Q8*R8","v":0}]
["Coupe-veille automatique",null,null,{"$f":"B9*C9","v":0},null,"Thermomètre de frigo",null,null,{"$f":"G9*H9","v":0},null,"Coupe-veille automatique",null,null,{"$f":"L9*M9","v":0},null,"Thermomètre de frigo",null,null,{"$f":"Q9*R9","v":0}]
["Lampe à LED pour l'éclairage d'accentuation",null,null,0,null,"Hygromètre",null,null,0,null,"Lampe à LED pour l'éclairage d'accentuation",null,null,0,null,"Hygromètre",null,null,0]
{"$rows_left_out":44}
{"sheet":"5. Criteres de selection","index":5,"n_rows":26,"n_cols":3,"rows_kept":26,"cut":false,"hidden":false,"merged":[[17,0,20,0],[0,0,3,2]]}
["Critères de sélection\n\nMerci de ne compléter que les cases jaunes et rouges foncées (menus déroulants)\nLes cases rouges clair se remplissent automatiquement\n\nLe remplissage des colonnes B et C fait office d'engagement de la collectivité vis-à-vis des critères de sélection."]
[]
[]
[]
["Critères de sélection","Vérifié","Commentaires pour le jury de sélection (si besoin)"]
["1. Le dispositif est piloté et financé ou co-financé par une ou des collectivités locales, leur groupement et établissement ou un groupement d'intérêt public (GIP)."]
["2. Le dispositif cible les ménages en situation de précarité énergétique, telle que définie dans la loi n° 90-449 du 31 mai 1990 visant à la mise en oeuvre du droit au logement, et quel que soit le statut d'occupation du logement."]
["3. Le dispositif prévoit une ou plusieurs démarche(s) d’identification des publics cibles, qu'il est en mesure d'expliciter. Il s'agit de : "]
["Ø     Traiter le stock de dossiers FSL qui constitue un premier gisement de cas à visiter systématiquement, notamment les ménages qui ont bénéficié plusieurs fois d’aides pour impayés d’énergie. "]
["Ø     Mener une campagne de visites systématiques dans les zones où se concentrent les situations de précarité énergétique."]
{"$rows_left_out":17}
{"sheet":"6. Forfaits","index":6,"n_rows":50,"n_cols":9,"rows_kept":50,"cut":false,"hidden":false,"merged":[[49,0,49,7],[0,0,3,8],[45,0,45,7],[46,0,46,7],[47,0,47,7],[48,0,48,7],[37,1,37,2],[40,3,42,3],[36,0,36,8],[27,1,30,1],[20,0,21,8],[13,8,14,8],[22,0,22,1],[13,2,14,2],[13,3,14,3],[13,4,14,4],[37,3,38,3],[37,4,38,4],[39,7,40,7],[13,5,14,5],[13,7,14,7],[13,6,14,6],[5,1,5,8],[4,0,4,8],[24,0,26,0],[28,0,30,0],[31,0,34,1],[23,1,26,1],[13,0,18,1],[6,1,6,2],[6,3,6,4],[6,5,6,6],[6,7,6,8]]}
["Forfait"]
[]
[]
[]
["Forfait (visite)"]
["Base",300]
[null,{"$f":"'1. Description generale'!A31","v":1904},null,{"$f":"'1. Description generale'!A32","v":"-"},null,{"$f":"'1. Description generale'!A33","v":"-"},null,{"$f":"'1. Description generale'!A34","v":"-"}]
["DST réalisé en deux visites ou en binôme",{"$f":"IF('1. Description generale'!E75=\"En binôme\",\"OUI\",IF('1. Description generale'!E86=2,\"OUI\",IF('1. Description generale'!E86=\"Plus\",\"OUI\",\"NON\")))","v":"NON"},100,{"$f":"IF('1. Description generale'!F75=\"En binôme\",\"OUI\",IF('1. Description generale'!F86=2,\"OUI\",IF('1. Description generale'!F86=\"Plus\",\"OUI\",\"NON\")))","v":"NON"},100,{"$f":"IF('1. Description generale'!G75=\"En binôme\",\"OUI\",IF('1. Description generale'!G86=2,\"OUI\",IF('1. Description generale'!G86=\"Plus\",\"OUI\",\"NON\")))","v":"NON"},100,{"$f":"IF('1. Description generale'!H75=\"En binôme\",\"OUI\",IF('1. Description generale'!H86=2,\"OUI\",IF('1. Description generale'!H86=\"Plus\",\"OUI\",\"NON\")))","v":"NON"},100]
["Profil \"expert\"",{"$f":"IF('1. Description generale'!E77=\"Conseiller énergie\",\"OUI\",IF('1. Description generale'!E77=\"Travailleur social\",\"OUI\",IF('1. Description generale'!E77=\"Conseiller habitat\",\"OUI\",\"NON\")))","v":"NON"},100,{"$f":"IF('1. Description generale'!F77=\"Conseiller énergie\",\"OUI\",IF('1. Description generale'!F77=\"Travailleur social\",\"OUI\",IF('1. Description generale'!F77=\"Conseiller habitat\",\"OUI\",\"NON\")))","v":"NON"},100,{"$f":"IF('1. Description generale'!G77=\"Conseiller énergie\",\"OUI\",IF('1. Description generale'!G77=\"Travailleur social\",\"OUI\",IF('1. Description generale'!G77=\"Conseiller habitat\",\"OUI\",\"NON\")))","v":"NON"},100,{"$f":"IF('1. Description generale'!H77=\"Conseiller énergie\",\"OUI\",IF('1. Description generale'!H77=\"Travailleur social\",\"OUI\",IF('1. Description generale'!H77=\"Conseiller habitat\",\"OUI\",\"NON\")))","v":"NON"},100]
["Soutien renforcé (au-dela des 20% minimum)",{"$f":"IF('1. Description generale'!E109<>\"NON\",\"OUI\",\"NON\")","v":"NON"},{"$f":"IF('1. Description generale'!E109<>\"NON\",(MID('1. Description generale'!E109,7,2)*50/10),0)","v":0},{"$f":"IF('1. Description generale'!F109<>\"NON\",\"OUI\",\"NON\")","v":"NON"},{"$f":"IF('1. Description generale'!F109<>\"NON\",(MID('1. Description generale'!F109,7,2)*50/10),0)","v":0},{"$f":"IF('1. Description generale'!G109<>\"NON\",\"OUI\",\"NON\")","v":"NON"},{"$f":"IF('1. Description generale'!G109<>\"NON\",(MID('1. Description generale'!G109,7,2)*50/10),0)","v":0},{"$f":"IF('1. Description generale'!H109<>\"NON\",\"OUI\",\"NON\")","v":"NON"},{"$f":"IF('1. Description generale'!H109<>\"NON\",(MID('1. Description generale'!H109,7,2)*50/10),0)","v":0}]
{"$rows_left_out":41}
{"sheet":"7. Fiche SLIME CLER","index":7,"n_rows":45,"n_cols":85,"rows_kept":45,"cut":false,"hidden":false,"merged":[[15,3,16,3],[10,0,10,2],[31,6,31,7],[27,6,27,7],[21,0,21,3],[22,2,23,2],[17,6,17,7],[0,0,3,7],[11,0,11,3],[12,2,13,2],[12,3,13,3],[14,0,14,3],[4,0,4,1],[4,2,4,3],[4,6,4,7],[6,6,6,7]]}
["Fiche Slime"]
[]
[]
[]
["Collectivité",null,"Contact",null,null,null,"Caractéristiques"]
["Collectivité",{"$f":"'1. Description generale'!A6","v":0},"Contact",{"$f":"'1. Description generale'!A8","v":0},null,null,"Outil de politique publique ",{"$f":"'1. Description generale'!E47 & IF('1. Description generale'!E48<>\"\",\" / \" & '1. Description generale'!E48,\" \") & IF('1. Description generale'!E49<>\"\",\" / \" & '1. Description generale'!E49,\" \")","v":"  "}]
["Nom local du dispositif",{"$f":"'1. Description generale'!B6","v":0},"Mail",{"$f":"'1. Description generale'!B8","v":0},null,null,"Repérage"]
["Territoire",{"$f":"'1. Description generale'!C6","v":0},"Téléphone",{"$f":"'1. Description generale'!C8","v":0},null,null,"Critères retenus",{"$f":"'1. Description generale'!E54 & IF('1. Description generale'!E55<>\"\",\" / \" & '1. Description generale'!E55,\" \") & IF('1. Description generale'!E56<>\"\",\" / \" & '1. Description generale'!E56,\" \" ) & IF('1. Description generale'!E57<>\"\",\" / \" & '1. Description generale'!E57,\" \") & IF('1. Description generale'!E58<>\"\",\" / \" & '1. Description generale'!E58,\" \") & IF('1. Description generale'!E59<>\"\",\" / \" & '1. Description generale'!E59,\" \") & IF('1. Description generale'!E60<>\"\",\" / \" & '1. Description generale'!E60,\" \")","v":"Revenus très modestes (seuils ANAH)      "}]
["Service",{"$f":"'1. Description generale'!D8","v":0},"Adresse",{"$f":"'1. Description generale'!D10","v":0},null,null,"Mobilisation des travailleurs sociaux de la collectivité pilote",{"$f":"'1. Description generale'!E63","v":0}]
["Département",{"$f":"'1. Description generale'!D6","v":0},"Type de dossier",{"$f":"'1. Description generale'!E50","v":0},null,null,"Réseau de donneurs d'alertes externe à la collectivité",{"$f":"'1. Description generale'!E65","v":0}]
{"$rows_left_out":36}
{"sheet":"Listes","index":8,"n_rows":14,"n_cols":31,"rows_kept":14,"cut":false,"hidden":false,"merged":[]}
["Densité de population","Age du dispositif","Outil de politique publique ","Type de dossier","Critères retenus","Lanceurs d'alerte","Quelle structure réalise les visites ?","Modalités de la visite","Quel est le profil des chargés de visite ?","Quel est le profil des chargés de visite (2ème) ?","Formation DST","Habilitation éléctrique","Nombre de visites par ménage","Installation des équipements","L'orientation se fait…","Quel est le principal format de remise du rapport de visite ? ","Qui décide de l'orientation ?","Options complémenataires","Soutien renforcé supplémentaire","Bénéficiaire","Ambassadeur Slime","Modalités de soutien renforcé","Formation bailleur-locataire","Type de territoire","Quelle structure réalise l'accompagnement renfocé ?","Coordination / Animation territoriale","Diagnostics socio-techniques et soutien renforcé","Evaluation","Formations","Accompagnement méthodologique","Avance"]
["Inférieure à 50hab/km2","1ère année","Actions de maîtrise de la demande d'énergie","Nouveau","Bénéficiaire ou demandeur du FSL énergie ou eau","OUI","Collectivité","Seul","Conseiller énergie","N/A","OUI","Réalisée ",1,"Le chargé de visite","Pendant la première visite","De visu","Le comité de suivi/orientation","NON","NON","Finance la collectivité","OUI","Accompagnement sur les usages de l'énergie/de l'eau","OUI","Régional","Collectivité","Gestion et suivi administratif","Coordination des visites à domicile","Gestion et suivi administratif ","Frais de formation au diagnostic sociotechnique","Frais d'accompagnement méthodologique par un \"Ambassadeur du Slime\"","NON"]
["Supérieure à 50hab/km2","2ème année","Dispositif d'aides curatives (hors FSL)","Renouvellement","Impayés d'eau et d'énergie récurrents","NON","Partenaire opérationnel","En binôme","Travailleur social","Conseiller énergie","NON","Non réalisée",2,"Le ménage (pendant la visite)","Lors d'une seconde visite","Par téléphone","L'animateur Slime","OUI","OUI - 10% suppl.","Finance directement un partenaire opérationnel","NON","Accompagnement social et budgétaire","NON","Départemental","Partenaire opérationnel","Actions de sensibilisation, animation et formation auprès des professionnels","Réalisation des visites à domicile","Réalisation de l'évaluation","Frais de formation à la médiation bailleur-locataire",null,"OUI - 5%"]
[null,"3ème année ou plus","Fonds local d'aide aux travaux",null,"Recours aux tarifs sociaux de l'énergie",null,"Collectivité et partenaire opérationnel","Les deux","Conseiller habitat","Travailleur social",null,null,"1 ou 2","Le ménage et le chargé de visite","Après la dernière visite","Par email","Le chargé de visite",null,"OUI - 20% suppl.","Finance directement l'achat d'équipements pour les ménages",null,"Paiement des factures d'énergie/d'eau",null,"Métropole","Collectivité et partenaire opérationnel","Communication","Recrutement des chargés de visites","Coordination et suivi opérationnel de l'évaluation","Habilitation électrique",null,"OUI - 10%"]
[null,null,"FSL (Fonds de solidarité pour le logement)",null,"Restriction / privation",null,null,null,"Emploi aidé","Conseiller habitat",null,null,"Plus",null,null,"Par courrier","Autre décideur, à préciser ci-dessous:",null,"OUI - 30% suppl.","Finance directement un autre poste",null,"Médiation, relation bailleur-locataire",null,"Infra-départemental (EPCI, commune, etc)",null,"Déplacements","Soutien renforcé (hors médiation)","Autre (préciser à droite)",null,null,"OUI - 15%"]
[null,null,"Opération programmée: OPAH, PIG …",null,"Revenus très modestes (seuils ANAH)",null,null,null,"Salarié en insertion par le travail","Emploi aidé",null,null,null,null,null,null,null,null,"OUI - 40% suppl.",null,null,"Travaux & équipements domestiques",null,null,null,"Coordination et suivi opérationnel du dispositif","Déplacements",null,null,null,"OUI - 20%"]
[null,null,"PDALHPD",null,"Sensation de froid",null,null,null,"Volontaire du Service Civique","Salarié en insertion par le travail",null,null,null,null,null,null,null,null,"OUI - 50% suppl.",null,null,"Relogement",null,null,null,"Autre (préciser à droite)","Équipements d'économies d'énergie",null,null,null,"OUI - 25%"]
[null,null,"Plan Climat Air Énergie Territorial",null,"Taux d'effort énergétique > 10%",null,null,null,"Autre","Volontaire du Service Civique",null,null,null,null,null,null,null,null,"OUI - 60% suppl.",null,null,"Autre, à préciser  à droite :",null,null,null,null,"Équipements de mesure mis à disposition des chargés de visite"]
[null,null,"Plan d'action pour l'habitat",null,"Autre critère, à préciser ci-dessous:",null,null,null,null,"Autre",null,null,null,null,null,null,null,null,"OUI - 70% suppl.",null,null,null,null,null,null,null,"Réalisation des médiations"]
[null,null,"Plan territorial de lutte contre la précarité énergétique",null,null,null,null,null,null,null,null,null,null,null,null,null,null,null,"OUI - 80% suppl.",null,null,null,null,null,null,null,"Autre (préciser à droite)"]
{"$rows_left_out":4}