{"text_format":"1","workbook":"xlsx","n_sheets":7,"sheets":["0. Instructions","1. Description generale","2. Budget","3. Equipements","4. Criteres de selection","5. Cofinancements","Listes"],"not_rendered":{"charts":0,"images":7,"macros":1,"external_links":0,"defined_names":39,"comments":1,"pivot_tables":0},"unopened":[],"bounds":{"document_bytes":16777216,"sheet_cells":100000,"rows_first":2000,"rows_last":500,"rows_between":2000,"halvings":0,"cell_chars":16384,"cell_head_chars":4096},"cells_cut":0,"cells_raw":0,"read":"whole","date_system":"1900"}

{"sheet":"0. Instructions","index":0,"n_rows":23,"n_cols":1,"rows_kept":23,"cut":false,"hidden":false,"merged":[[10,0,10,3],[0,0,3,3],[5,0,5,3],[4,0,4,3],[7,0,7,3],[6,0,6,3],[8,0,8,3],[9,0,9,3],[20,0,20,3],[21,0,21,3],[22,0,22,3],[11,0,11,3],[17,0,17,3],[18,0,18,3],[16,0,16,3],[19,0,19,3],[12,0,12,3],[13,0,13,3],[14,0,14,3],[15,0,15,3]]}
["Note pour remplissage du dossier de candidature"]
[]
[]
[]
["Informations générales"]
["Se référer au site internet du Slime (www.lesslime.fr) pour :\nle descriptif du dispositif, la foire aux questions, les vidéos présentant les visites à domicile, le dossier de candidature et les actualités du dispositif"]
["La collectivité ne doit remplir que les cases jaunes et rouges foncées (menus déroulants). Les cases rouges clair se remplissent automatiquement"]
["Pour l’onglet 1. Description générale"]
["La \"Présentation générale de l’action\" doit être synthétique (3000 caractères maximum)"]
["Pour l’onglet 2. Budget"]
["La collectivité doit contacter le CLER si elle souhaite ajouter des lignes au budget."]
["La collectivité doit sélectionner via les menus déroulants le type de dépense en question. La collectivité peut demander au CLER d'en ajouter, ou à défaut, de laisser la case vide et détailler la dépense dans la case à côté \"détailler dépense si besoin\"."]
["La catégorie \"1. Coordination du dispositif et animation territoriale\" fait référence aux dépenses en lien avec l'animation du réseau Slime, telles que:\n\n- gestion globale et administrative du projet;\n- mobilisation, sensibilisation et formation des donneurs d'alerte et des acteurs relais;\n- coordination d'un comité d'orientation;\n- communication;\n- animation, organisation d'interventions, de réunions;\n- élargissement de son réseau de partenaires;\n- actions pour améliorer l'efficacité de son Slime."]
["La catégorie \"3. Evaluation\" fait référence aux dépenses en lien avec l'évaluation locale du dispositif, telles que:\n\n- organisation et coordination de l'évaluation;\n- réalisation de l'évaluation;\n- communication autour de l'évaluation."]
["La catégorie \"2. Diagnostics socio-techniques et soutien renforcé\" fait référence aux dépenses en lien avec les visites à domicile, telles que: \n\n- coordination;\n- organisation et réalisation des diagnostics sociotechniques;\n- installation des petits équipements;\n- orientation et accompagnement du ménage après la visite. "]
{"$rows_left_out":9}
{"sheet":"1. Description generale","index":1,"n_rows":118,"n_cols":8,"rows_kept":118,"cut":false,"hidden":false,"merged":[[101,0,101,2],[104,0,104,2],[105,0,105,7],[117,0,117,2],[116,0,116,3],[115,0,115,6],[114,0,114,2],[112,0,112,2],[111,0,111,4],[113,0,113,4],[66,3,67,3],[68,3,69,3],[65,0,75,2],[38,0,38,4],[85,4,86,4],[0,1,3,4],[108,0,110,4],[107,0,107,2],[76,0,76,4],[7,3,7,4],[4,3,4,4],[5,3,5,4],[43,0,43,4],[44,0,44,4],[54,0,54,4],[6,3,6,4],[8,3,8,4],[9,3,9,4],[84,3,86,3],[17,3,18,3],[17,4,18,4],[99,0,99,7],[102,0,102,7],[96,0,98,7],[64,0,64,4],[39,0,42,2],[39,3,41,3],[81,0,81,4],[45,0,45,4],[55,0,63,2],[46,0,53,2],[70,3,71,3],[77,0,80,2],[77,3,78,3],[88,3,94,3],[82,0,95,2],[46,3,53,3]]}
[null,"Description générale du dispositif\n\nMerci de ne compléter que les cases jaunes et rouges foncées (menus déroulants)\nLes cases rouges clair se remplissent automatiquement"]
[]
[]
[]
["Collectivité pilotant le Slime (cf critère de sélection 1)","Nom local du dispositif (par ex. Slime CLER…)","Territoire d'action du dispositif Slime","Département"]
[]
["Responsable du dispositif (NOM Prénom)","Adresse email","Numéro de téléphone","Service"]
[]
["Date de début du dispositif (jj/mm/aaaa)","Date de fin du dispositif (jj/mm/aaaa)","Durée de l'action (en mois)","Adresse"]
[null,null,{"$f":"ROUND((B10-A10)*12/365,0)","v":0}]
[]
["Budget total du dispositif local Slime ","Budget de la collectivité éligible au co-financement via le Slime","Participation directe des autres partenaires","Co-financement Slime possible (total)"]
[{"$f":"'2. Budget'!F92+'2. Budget'!M92+'2. Budget'!T92+'2. Budget'!AA92","v":0},{"$f":"'2. Budget'!F74+'2. Budget'!M74+'2. Budget'!T74+'2. Budget'!AA74","v":0},{"$f":"A13-B13","v":0},{"$f":"'5. Cofinancements'!I44","v":{"$error":"#N/A"}}]
[]
["Nombre de ménages sur le territoire d'action",null,null,"Coût par ménage",{"$f":"A13/D37","v":{"$error":"#DIV/0!"}}]
{"$rows_left_out":104}
{"sheet":"2. Budget","index":2,"n_rows":92,"n_cols":20,"rows_kept":92,"cut":false,"hidden":false,"merged":[[91,7,91,11],[77,14,77,18],[78,16,78,19],[79,16,79,19],[80,16,80,19],[81,16,81,19],[82,14,82,18],[83,16,83,19],[84,16,84,19],[85,16,85,19],[86,16,86,19],[87,16,87,19],[88,16,88,19],[91,14,91,18],[84,9,84,12],[85,9,85,12],[86,9,86,12],[87,9,87,12],[88,9,88,12],[79,2,79,5],[80,2,80,5],[81,2,81,5],[82,0,82,4],[83,2,83,5],[80,9,80,12],[88,2,88,5],[8,12,12,12],[14,12,18,12],[74,0,74,4],[74,7,74,11],[76,0,76,5],[76,7,76,12],[69,7,69,11],[73,7,73,11],[58,12,62,12],[64,12,68,12],[42,7,42,11],[44,12,48,12],[50,12,54,12],[19,7,19,11],[21,12,30,12],[32,12,41,12],[8,19,12,19],[14,19,18,19],[19,14,19,18],[21,19,30,19],[32,19,41,19],[0,7,3,12],[4,7,4,12],[5,7,5,11],[6,7,6,11],[0,14,3,19],[4,14,4,19],[5,14,5,18],[6,14,6,18],[74,14,74,18],[76,14,76,19],[77,7,77,11],[78,9,78,12],[79,9,79,12],[73,14,73,18],[42,14,42,18],[44,19,48,19],[50,19,54,19],[55,14,55,18],[56,14,56,18],[58,5,62,5],[64,5,68,5],[58,19,62,19],[64,19,68,19],[69,14,69,18],[50,5,54,5],[44,5,48,5],[14,5,18,5],[55,7,55,11],[56,7,56,11],[32,5,41,5],[0,0,3,5],[4,0,4,5],[5,0,5,4],[6,0,6,4],[19,0,19,4],[8,5,12,5],[91,0,91,4],[81,9,81,12],[82,7,82,11],[83,9,83,12],[21,5,30,5],[84,2,84,5],[85,2,85,5],[86,2,86,5],[87,2,87,5],[77,0,77,4],[78,2,78,5],[42,0,42,4],[55,0,55,4],[56,0,56,4],[69,0,69,4],[73,0,73,4]]}
["Budget previsionnel\n\nMerci de ne completer que les cases jaunes et rouges foncees (menus deroulants)\nLes cases rouges clair se remplissent automatiquement",null,null,null,null,null,null,"Budget previsionnel\n\nMerci de ne completer que les cases jaunes et rouges foncees (menus deroulants)\nLes cases rouges clair se remplissent automatiquement",null,null,null,null,null,null,"Budget previsionnel\n\nMerci de ne completer que les cases jaunes et rouges foncees (menus deroulants)\nLes cases rouges clair se remplissent automatiquement"]
[]
[]
[]
[{"$f":"CONCATENATE(\"DEPENSES PREVISIONNELLES DE LA COLLECTIVITE ANNEE \",'1. Description generale'!A30)","v":"DEPENSES PREVISIONNELLES DE LA COLLECTIVITE ANNEE 1904"},null,null,null,null,null,null,{"$f":"CONCATENATE(\"DEPENSES PREVISIONNELLES DE LA COLLECTIVITE ANNEE \",'1. Description generale'!A31)","v":"DEPENSES PREVISIONNELLES DE LA COLLECTIVITE ANNEE -"},null,null,null,null,null,null,{"$f":"CONCATENATE(\"DEPENSES PREVISIONNELLES DE LA COLLECTIVITE ANNEE \",'1. Description generale'!A32)","v":"DEPENSES PREVISIONNELLES DE LA COLLECTIVITE ANNEE -"}]
[{"$f":" \"Activites \" & '1. Description generale'!A30","v":"Activites 1904"},null,null,null,null,{"$f":"\"Depenses previsionnelles (€) \"& '1. Description generale'!A30","v":"Depenses previsionnelles (€) 1904"},null,{"$f":" \"Activites \" & '1. Description generale'!A31","v":"Activites -"},null,null,null,null,{"$f":"\"Depenses previsionnelles (€) \"& '1. Description generale'!A31","v":"Depenses previsionnelles (€) -"},null,{"$f":" \"Activites \" & '1. Description generale'!A32","v":"Activites -"},null,null,null,null,{"$f":"\"Depenses previsionnelles (€) \"& '1. Description generale'!A32","v":"Depenses previsionnelles (€) -"}]
["1. Coordination du dispositif et animation territoriale",null,null,null,null,{"$f":"F9+F15","v":0},null,"1. Coordination du dispositif et animation territoriale",null,null,null,null,{"$f":"M9+M15","v":0},null,"1. Coordination du dispositif et animation territoriale",null,null,null,null,{"$f":"T9+T15","v":0}]
["Depenses d'exploitation (frais directs)","detailler depense si besoin","Coût jour ou unitaire","Nombre (jours, km, kits, etc)","Montant (€)",null,null,"Depenses d'exploitation (frais directs)","detailler depense si besoin","Coût jour ou unitaire","Nombre (jours, km, kits, etc)","Montant (€)",null,null,"Depenses d'exploitation (frais directs)","detailler depense si besoin","Coût jour ou unitaire","Nombre (jours, km, kits, etc)","Montant (€)"]
[null,null,null,null,{"$f":"C9*D9","v":0},{"$f":"SUM(E9:E13)","v":0},null,null,null,null,null,{"$f":"J9*K9","v":0},{"$f":"SUM(L9:L13)","v":0},null,null,null,null,null,{"$f":"Q9*R9","v":0},{"$f":"SUM(S9:S13)","v":0}]
[null,null,null,null,{"$f":"C10*D10","v":0},null,null,null,null,null,null,{"$f":"J10*K10","v":0},null,null,null,null,null,null,{"$f":"Q10*R10","v":0}]
[null,null,null,null,0,null,null,null,null,null,null,0,null,null,null,null,null,null,0]
[null,null,null,null,0,null,null,null,null,null,null,0,null,null,null,null,null,null,0]
[null,null,null,null,0,null,null,null,null,null,null,0,null,null,null,null,null,null,0]
["Depenses de personnel (moyens humains)","detailler depense si besoin","Coût jour ou unitaire","Nombre (jours, km, kits, etc)","Montant (€)",null,null,"Depenses de personnel (moyens humains)","detailler depense si besoin","Coût jour ou unitaire","Nombre (jours, km, kits, etc)","Montant (€)",null,null,"Depenses de personnel (moyens humains)","detailler depense si besoin","Coût jour ou unitaire","Nombre (jours, km, kits, etc)","Montant (€)"]
[null,null,null,null,0,{"$f":"SUM(E15:E19)","v":0},null,null,null,null,null,{"$f":"J15*K15","v":0},{"$f":"SUM(L15:L19)","v":0},null,null,null,null,null,{"$f":"Q15*R15","v":0},{"$f":"SUM(S15:S19)","v":0}]
{"$rows_left_out":78}
{"sheet":"3. Equipements","index":3,"n_rows":53,"n_cols":19,"rows_kept":53,"cut":false,"hidden":false,"merged":[[31,0,31,8],[32,0,32,3],[32,5,32,8],[0,1,3,8],[0,11,3,18],[27,1,30,8],[5,0,5,3],[5,5,5,8],[4,0,4,8],[4,10,4,18],[5,10,5,13],[5,15,5,18]]}
[null,"Budget prévisionnel - petits équipements\n\nMerci de ne compléter que les cases jaunes\nLes cases rouges clair se remplissent automatiquement",null,null,null,null,null,null,null,null,null,"Budget prévisionnel - petits équipements\n\nMerci de ne compléter que les cases jaunes\nLes cases rouges clair se remplissent automatiquement"]
[]
[]
[]
[{"$f":"CONCATENATE(\"ANNEE \",'1. Description generale'!A30)","v":"ANNEE 1904"},null,null,null,null,null,null,null,null,null,{"$f":"CONCATENATE(\"ANNEE \",'1. Description generale'!A31)","v":"ANNEE -"}]
["Liste des équipements d'économie d'énergie installés chez les ménages pendant la visite à domicile",null,null,null,null,"Liste des équipements de mesure utilisés pendant les visites à domicile",null,null,null,null,"Liste des équipements d'économie d'énergie installés chez les ménages pendant la visite à domicile",null,null,null,null,"Liste des équipements de mesure utilisés pendant les visites à domicile"]
["Équipement d'économies d'énergie","Coût unitaire","Nombre","Total",null,"Équipements de mesure","Coût unitaire","Nombre","Total",null,"Équipement d'économies d'énergie","Coût unitaire","Nombre","Total",null,"Équipements de mesure","Coût unitaire","Nombre","Total"]
["Lampe de classe A pour la métropole",null,null,{"$f":"B8*C8","v":0},null,"Thermomètre",null,null,{"$f":"G8*H8","v":0},null,"Lampe de classe A pour la métropole",null,null,{"$f":"L8*M8","v":0},null,"Thermomètre",null,null,{"$f":"Q8*R8","v":0}]
["Coupe-veille automatique",null,null,{"$f":"B9*C9","v":0},null,"Thermomètre de frigo",null,null,{"$f":"G9*H9","v":0},null,"Coupe-veille automatique",null,null,{"$f":"L9*M9","v":0},null,"Thermomètre de frigo",null,null,{"$f":"Q9*R9","v":0}]
["Lampe à LED pour l'éclairage d'accentuation",null,null,0,null,"Hygromètre",null,null,0,null,"Lampe à LED pour l'éclairage d'accentuation",null,null,0,null,"Hygromètre",null,null,0]
["Isolation d’un réseau hydraulique de chauffage",null,null,0,null,"Mètre laser",null,null,0,null,"Isolation d’un réseau hydraulique de chauffage",null,null,0,null,"Mètre laser",null,null,0]
["Robinet thermostatique",null,null,0,null,"Débitmètre",null,null,0,null,"Robinet thermostatique",null,null,0,null,"Débitmètre",null,null,0]
["Programmateur d'intermittence centralisé pour un chauffage à combustible",null,null,0,null,"Wattmètre",null,null,0,null,"Programmateur d'intermittence centralisé pour un chauffage à combustible",null,null,0,null,"Wattmètre",null,null,0]
["Programmateur d'intermittence centralisé pour un chauffage électrique",null,null,0,null,"Autre équipement de mesure (préciser)",null,null,0,null,"Programmateur d'intermittence centralisé pour un chauffage électrique",null,null,0,null,"Autre équipement de mesure (préciser)",null,null,0]
["Reducteur de débit pour robinet",null,null,0,null,"Autre équipement de mesure (préciser)",null,null,0,null,"Reducteur de débit pour robinet",null,null,0,null,"Autre équipement de mesure (préciser)",null,null,0]
{"$rows_left_out":39}
{"sheet":"4. Criteres de selection","index":4,"n_rows":25,"n_cols":3,"rows_kept":25,"cut":false,"hidden":false,"merged":[[17,0,19,0],[0,0,3,2]]}
["Critères de sélection\n\nMerci de ne compléter que les cases jaunes et rouges foncées (menus déroulants)\nLes cases rouges clair se remplissent automatiquement\n\nLe remplissage des colonnes B et C fait office d'engagement de la collectivité vis-à-vis des critères de sélection."]
[]
[]
[]
["Critères de sélection","Vérifié","Commentaires pour le jury de sélection (si besoin)"]
["1. Le dispositif est piloté et financé ou co-financé par une ou des collectivités locales, leur groupement et établissement ou un groupement d'intérêt public (GIP)."]
["2. Le dispositif cible les ménages en situation de précarité énergétique, telle que définie dans la loi n° 90-449 du 31 mai 1990 visant à la mise en oeuvre du droit au logement, et quel que soit le statut d'occupation du logement."]
["3. Le dispositif prévoit une ou plusieurs démarche(s) d’identification des publics cibles, qu'il est en mesure d'expliciter. Il s'agit de : "]
["Ø     Traiter le stock de dossiers FSL qui constitue un premier gisement de cas à visiter systématiquement, notamment les ménages qui ont bénéficié plusieurs fois d’aides pour impayés d’énergie. "]
["Ø     Mener une campagne de visites systématiques dans les zones où se concentrent les situations de précarité énergétique."]
["Ø     Intervenir au cas par cas, suite à un signalement par des « donneurs d’alertes » (travailleurs sociaux, intervenants médicaux…) ou par les ménages eux-mêmes."]
["Ø     Autre démarche d'identification (à détailler)"]
["4. Le dispositif comporte a minima une visite du ménage dans son logement, qui vise à établir avec la famille un diagnostic socio-technique de sa situation.  Cette visite ne pré-suppose pas de travaux. Elle est d'abord destinée à identifier les situations de précarité énergétique, et qualifier la situation du ménage. "]
["5. Le dispositif prévoit l’installation durant la visite, de petits équipements peu onéreux et permettant rapidement des économies et/ou l’amélioration du confort. Ces équipements peuvent concerner à la fois l’énergie et l’eau (ampoules basse consommation, multiprise avec interrupteur, joint de fenêtre, survitrage, aérateur de robinet, réducteur de débit…). "]
["6. En amont des visites, le dispositif prévoit et organise l’information et la coordination régulière des partenaires concernés, notamment pour les donneurs d’alerte et relais locaux à même de faire « remonter » des ménages susceptibles de bénéficier d’une visite à domicile."]
{"$rows_left_out":11}
{"sheet":"5. Cofinancements","index":5,"n_rows":44,"n_cols":9,"rows_kept":44,"cut":false,"hidden":false,"merged":[[13,6,14,6],[43,0,43,7],[0,0,3,8],[40,0,40,7],[41,0,41,7],[42,0,42,7],[33,1,33,2],[36,3,37,3],[32,0,32,8],[25,1,27,1],[19,0,20,8],[13,8,14,8],[21,0,21,1],[13,2,14,2],[13,3,14,3],[13,4,14,4],[0,9,43,9],[4,0,4,8],[23,0,24,0],[26,0,27,0],[28,0,30,1],[22,1,24,1],[13,0,17,1],[6,1,6,2],[6,3,6,4],[6,5,6,6],[5,1,5,6],[33,3,34,3],[33,4,34,4],[35,7,36,7],[13,5,14,5],[13,7,14,7]]}
["Cofinancements"]
[]
[]
[]
["Réalisation des visites (forfait)"]
["Base",300]
[null,{"$f":"'1. Description generale'!A30","v":1904},null,{"$f":"'1. Description generale'!A31","v":"-"},null,{"$f":"'1. Description generale'!A32","v":"-"}]
["DST réalisé en deux visites ou en binôme",{"$f":"IF('1. Description generale'!E68=\"En binôme\",\"OUI\",IF('1. Description generale'!E79=2,\"OUI\",IF('1. Description generale'!E79=\"Plus\",\"OUI\",\"NON\")))","v":"NON"},100,{"$f":"IF('1. Description generale'!F68=\"En binôme\",\"OUI\",IF('1. Description generale'!F79=2,\"OUI\",IF('1. Description generale'!F79=\"Plus\",\"OUI\",\"NON\")))","v":"NON"},100,{"$f":"IF('1. Description generale'!G68=\"En binôme\",\"OUI\",IF('1. Description generale'!G79=2,\"OUI\",IF('1. Description generale'!G79=\"Plus\",\"OUI\",\"NON\")))","v":"NON"},100]
["Profil \"expert\"",{"$f":"IF('1. Description generale'!E70=\"Conseiller énergie\",\"OUI\",IF('1. Description generale'!E70=\"Travailleur social\",\"OUI\",IF('1. Description generale'!E70=\"Conseiller habitat\",\"OUI\",\"NON\")))","v":"NON"},100,{"$f":"IF('1. Description generale'!F70=\"Conseiller énergie\",\"OUI\",IF('1. Description generale'!F70=\"Travailleur social\",\"OUI\",IF('1. Description generale'!F70=\"Conseiller habitat\",\"OUI\",\"NON\")))","v":"NON"},100,{"$f":"IF('1. Description generale'!G70=\"Conseiller énergie\",\"OUI\",IF('1. Description generale'!G70=\"Travailleur social\",\"OUI\",IF('1. Description generale'!G70=\"Conseiller habitat\",\"OUI\",\"NON\")))","v":"NON"},100]
["Soutien renforcé (au-dela des 20% minimum)",{"$f":"IF('1. Description generale'!E102<>\"NON\",\"OUI\",\"NON\")","v":"NON"},{"$f":"IF('1. Description generale'!E102<>\"NON\",(MID('1. Description generale'!E102,7,2)*50/10),0)","v":0},{"$f":"IF('1. Description generale'!F102<>\"NON\",\"OUI\",\"NON\")","v":"NON"},{"$f":"IF('1. Description generale'!F102<>\"NON\",(MID('1. Description generale'!F102,7,2)*50/10),0)","v":0},{"$f":"IF('1. Description generale'!G102<>\"NON\",\"OUI\",\"NON\")","v":"NON"},{"$f":"IF('1. Description generale'!G102<>\"NON\",(MID('1. Description generale'!G102,7,2)*50/10),0)","v":0}]
["Forte articulation avec des dispositifs de type FSATME",{"$f":"'1. Description generale'!E105","v":"NON"},50,{"$f":"'1. Description generale'!F105","v":"NON"},50,{"$f":"'1. Description generale'!G105","v":"NON"},50]
["Suivi N+1",{"$f":"'1. Description generale'!E108","v":"NON"},50,{"$f":"'1. Description generale'!F108","v":"NON"},50,{"$f":"'1. Description generale'!G108","v":"NON"},50]
["Réalisation des médiations",{"$f":"'1. Description generale'!E118","v":"NON"},100,{"$f":"'1. Description generale'!F118","v":"NON"},100,{"$f":"'1. Description generale'!G118","v":"NON"},100]
["Cofinancement (visites) - annuel",null,"Forfait","Années","Plafond","Taux de cofinancement","Dépenses prévisionnelles","Dépenses éligibles","Cofinancements"]
[]
{"$rows_left_out":30}
{"sheet":"Listes","index":6,"n_rows":14,"n_cols":31,"rows_kept":14,"cut":false,"hidden":false,"merged":[]}
["Densité de population","Age du dispositif","Outil de politique publique ","Type de dossier","Critères retenus","Lanceurs d'alerte","Quelle structure réalise les visites ?","Modalités de la visite","Quel est le profil des chargés de visite ?","Quel est le profil des chargés de visite (2ème) ?","Formation DST","Habilitation éléctrique","Nombre de visites par ménage","Installation des équipements","L'orientation se fait…","Quel est le principal format de remise du rapport de visite ? ","Qui décide de l'orientation ?","Options complémenataires","Soutien renforcé supplémentaire","Bénéficiaire","Ambassadeur Slime","Modalités de soutien renforcé","Formation bailleur-locataire","Type de territoire","Quelle structure réalise l'accompagnement renfocé ?","Coordination / Animation territoriale","Diagnostics socio-techniques et soutien renforcé","Evaluation","Formations","Accompagnement méthodologique","Avance"]
["Inférieure à 50hab/km2","1ère année","Actions de maîtrise de la demande d'énergie","Nouveau","Bénéficiaire ou demandeur du FSL énergie ou eau","OUI","Collectivité","Seul","Conseiller énergie","N/A","OUI","Réalisée ",1,"Le chargé de visite","Pendant la première visite","De visu","Le comité de suivi/orientation","NON","NON","Finance directement un partenaire opérationnel","OUI","Accompagnement sur les usages de l'énergie/de l'eau","OUI","Régional","Collectivité","Gestion et suivi administratif","Coordination des visites à domicile","Gestion et suivi administratif ","Frais de formation au diagnostic sociotechnique","Frais d'accompagnement méthodologique par un \"Ambassadeur du Slime\"","NON"]
["Supérieure à 50hab/km2","2ème année","Dispositif d'aides curatives (hors FSL)","Renouvellement","Impayés d'eau et d'énergie récurrents","NON","Partenaire opérationnel","En binôme","Travailleur social","Conseiller énergie","NON","Non réalisée",2,"Le ménage (pendant la visite)","Lors d'une seconde visite","Par téléphone","L'animateur Slime","OUI","OUI - 10% suppl.","Finance directement l'achat d'équipements pour les ménages","NON","Accompagnement social et budgétaire","NON","Départemental","Partenaire opérationnel","Actions de sensibilisation, animation et formation auprès des professionnels","Réalisation des visites à domicile","Réalisation de l'évaluation","Frais de formation à la médiation bailleur-locataire",null,"OUI - 5%"]
[null,"3ème année ou plus","Fonds local d'aide aux travaux",null,"Recours aux tarifs sociaux de l'énergie",null,"Collectivité et partenaire opérationnel","Les deux","Conseiller habitat","Travailleur social",null,null,"1 ou 2","Le ménage et le chargé de visite","Après la dernière visite","Par email","Le chargé de visite",null,"OUI - 20% suppl.","Finance directement un autre poste",null,"Paiement des factures d'énergie/d'eau",null,"Métropole","Collectivité et partenaire opérationnel","Communication","Recrutement des chargés de visites","Coordination et suivi opérationnel de l'évaluation","Habilitation électrique",null,"OUI - 10%"]
[null,null,"FSL (Fonds de solidarité pour le logement)",null,"Restriction / privation",null,null,null,"Emploi aidé","Conseiller habitat",null,null,"Plus",null,null,"Par courrier","Autre décideur, à préciser ci-dessous:",null,"OUI - 30% suppl.",null,null,"Médiation, relation bailleur-locataire",null,"Infra-départemental (EPCI, commune, etc)",null,"Déplacements","Soutien renforcé (hors médiation)","Autre (préciser à droite)",null,null,"OUI - 15%"]
[null,null,"Opération programmée: OPAH, PIG …",null,"Revenus très modestes (seuils ANAH)",null,null,null,"Salarié en insertion par le travail","Emploi aidé",null,null,null,null,null,null,null,null,"OUI - 40% suppl.",null,null,"Travaux & équipements domestiques",null,null,null,"Coordination et suivi opérationnel du dispositif","Déplacements",null,null,null,"OUI - 20%"]
[null,null,"PDALHPD",null,"Sensation de froid",null,null,null,"Volontaire du Service Civique","Salarié en insertion par le travail",null,null,null,null,null,null,null,null,"OUI - 50% suppl.",null,null,"Relogement",null,null,null,"Autre (préciser à droite)","Équipements d'économies d'énergie",null,null,null,"OUI - 25%"]
[null,null,"Plan Climat Air Énergie Territorial",null,"Taux d'effort énergétique > 10%",null,null,null,"Autre","Volontaire du Service Civique",null,null,null,null,null,null,null,null,"OUI - 60% suppl.",null,null,"Autre, à préciser  à droite :",null,null,null,null,"Équipements de mesure mis à disposition des chargés de visite"]
[null,null,"Plan d'action pour l'habitat",null,"Autre critère, à préciser ci-dessous:",null,null,null,null,"Autre",null,null,null,null,null,null,null,null,"OUI - 70% suppl.",null,null,null,null,null,null,null,"Réalisation des médiations"]
[null,null,"Plan territorial de lutte contre la précarité énergétique",null,null,null,null,null,null,null,null,null,null,null,null,null,null,null,"OUI - 80% suppl.",null,null,null,null,null,null,null,"Autre (préciser à droite)"]
[null,null,"Plateforme locale de la rénovation énergétique"]
[null,null,"Politique de la ville"]
[null,null,"TEPOS"]
[null,null,"Autre"]